{"text_format":"1","workbook":"xlsx","n_sheets":19,"sheets":["Overview","Initial Settings","Lists_Hidden","Market Inputs","Owner-Operator Inputs","Private Sector Partner Inputs","Public Sector Partner Inputs","Owner-Operator DCF","Private Sector Partner DCF","Public Sector Partner DCF","Combined DCF","Debt Schedule","Terminal Value Model","Outputs Dashboard","Sensitivity Tables","Income Statement","Balance Sheet","Cash Flow Statements","Version"],"not_rendered":{"charts":23,"images":0,"macros":1,"external_links":0,"defined_names":8898,"comments":0,"pivot_tables":0},"unopened":[],"bounds":{"document_bytes":16777216,"sheet_cells":100000,"rows_first":2000,"rows_last":500,"rows_between":2000,"halvings":0,"cell_chars":16384,"cell_head_chars":4096},"cells_cut":0,"cells_raw":0,"read":"whole","date_system":"1900"}

{"sheet":"Overview","index":0,"n_rows":2,"n_cols":8,"rows_kept":2,"cut":false,"hidden":false,"merged":[[0,1,0,8]]}
[null,"EV Charging Financial Analysis Tool"]
[null,{"$f":" \"Version \" & TEXT(MAX(Version[Version]), \"#,##0.00\")","v":"Version 2.00"},null,null,null,null,null,{"$f":" \"Last Updated: \" & TEXT(MAX(Version[Date]), \"m/d/yyyy\")","v":"Last Updated: 2/3/2017"}]

{"sheet":"Initial Settings","index":1,"n_rows":27,"n_cols":14,"rows_kept":27,"cut":false,"hidden":false,"merged":[]}
[{"$f":"B5","v":"Corridor and Community DC Fast Charging Complex (Urban Site)"}]
[]
["Initial Settings"]
[null,null,null,null,null,null," "]
["Scenario Name","Corridor and Community DC Fast Charging Complex (Urban Site)"]
["Initial Year",2017]
{"$rows_left_out":22}
{"sheet":"Lists_Hidden","index":2,"n_rows":271,"n_cols":7,"rows_kept":271,"cut":false,"hidden":true,"merged":[[2,0,2,5]]}
[{"$f":"'Initial Settings'!B5","v":"Corridor and Community DC Fast Charging Complex (Urban Site)"}]
[]
["Lists"]
[]
["Yes/No List",null,"Input Fields",null,null,"Input Fields from Excel"]
["Y",null,"Input Field","Field Code",null,"Input Field","Field Code"]
{"$rows_left_out":266}
{"sheet":"Market Inputs","index":3,"n_rows":49,"n_cols":15,"rows_kept":49,"cut":false,"hidden":false,"merged":[]}
[{"$f":"'Initial Settings'!B5","v":"Corridor and Community DC Fast Charging Complex (Urban Site)"}]
[]
[]
["Market Assumptions"]
[]
["EV fuel economy [miles per kilowatt-hour]",null,{"$f":"IFERROR(INDIRECT(VLOOKUP(MID(CELL(\"filename\",E6),FIND(\"]\", CELL(\"filename\",E6))+1,32) & \"!\" & ADDRESS(ROW(E6),COLUMN(E6),4,1), SensitivitySummary[[#All],[Field Lookup]:[Sensitivity Reference]], 2, FALSE)), E6)","v":3.5},null,3.5]
{"$rows_left_out":44}
{"sheet":"Owner-Operator Inputs","index":4,"n_rows":349,"n_cols":15,"rows_kept":349,"cut":false,"hidden":false,"merged":[[9,4,9,5],[84,4,84,5],[159,4,159,5]]}
[{"$f":"'Initial Settings'!$B$5","v":"Corridor and Community DC Fast Charging Complex (Urban Site)"}]
[]
[]
["Charging Station Assumptions"]
[]
["Expected equipment lifespan [years] - All equipment types",null,null,null,10]
{"$rows_left_out":344}
{"sheet":"Private Sector Partner Inputs","index":5,"n_rows":62,"n_cols":15,"rows_kept":62,"cut":false,"hidden":false,"merged":[]}
[{"$f":"'Initial Settings'!$B$5","v":"Corridor and Community DC Fast Charging Complex (Urban Site)"}]
[]
[]
["Private Sector Partner(s) Inputs"]
[]
["Private Sector Weighted Average Cost of Capital (WACC)",null,{"$f":"IFERROR(INDIRECT(VLOOKUP(MID(CELL(\"filename\",E6),FIND(\"]\", CELL(\"filename\",E6))+1,32) & \"!\" & ADDRESS(ROW(E6),COLUMN(E6),4,1), SensitivitySummary[[#All],[Field Lookup]:[Sensitivity Reference]], 2, FALSE)), E6)","v":0.1033},null,0.1033]
{"$rows_left_out":57}
{"sheet":"Public Sector Partner Inputs","index":6,"n_rows":20,"n_cols":15,"rows_kept":20,"cut":false,"hidden":false,"merged":[[17,0,17,2]]}
[{"$f":"'Initial Settings'!$B$5","v":"Corridor and Community DC Fast Charging Complex (Urban Site)"}]
[]
[]
["Public Sector Partner Inputs"]
[]
["Public Sector Cost of Capital [%]",null,{"$f":"IFERROR(INDIRECT(VLOOKUP(MID(CELL(\"filename\",E6),FIND(\"]\", CELL(\"filename\",E6))+1,32) & \"!\" & ADDRESS(ROW(E6),COLUMN(E6),4,1), SensitivitySummary[[#All],[Field Lookup]:[Sensitivity Reference]], 2, FALSE)), E6)","v":5.3999999999999999E-2},null,5.3999999999999999E-2]
{"$rows_left_out":15}
{"sheet":"Owner-Operator DCF","index":7,"n_rows":29,"n_cols":13,"rows_kept":29,"cut":false,"hidden":false,"merged":[]}
[{"$f":"'Initial Settings'!$B$5","v":"Corridor and Community DC Fast Charging Complex (Urban Site)"}]
[]
[]
["Owner-Operator Discounted Cash Flow Model",null,{"$f":"'Initial Settings'!$B$6","v":2017},{"$f":"'Owner-Operator Inputs'!F304","v":2018},{"$f":"'Owner-Operator Inputs'!G304","v":2019},{"$f":"'Owner-Operator Inputs'!H304","v":2020},{"$f":"'Owner-Operator Inputs'!I304","v":2021},{"$f":"'Owner-Operator Inputs'!J304","v":2022},{"$f":"'Owner-Operator Inputs'!K304","v":2023},{"$f":"'Owner-Operator Inputs'!L304","v":2024},{"$f":"'Owner-Operator Inputs'!M304","v":2025},{"$f":"'Owner-Operator Inputs'!N304","v":2026},{"$f":"'Owner-Operator Inputs'!O304","v":2027}]
[]
["Revenue",null,null,{"$f":"'Owner-Operator Inputs'!F266","v":131400},{"$f":"'Owner-Operator Inputs'!G266","v":137970},{"$f":"'Owner-Operator Inputs'!H266","v":144870},{"$f":"'Owner-Operator Inputs'!I266","v":152110},{"$f":"'Owner-Operator Inputs'!J266","v":159720},{"$f":"'Owner-Operator Inputs'!K266","v":167710},{"$f":"'Owner-Operator Inputs'!L266","v":176100},{"$f":"'Owner-Operator Inputs'!M266","v":184910},{"$f":"'Owner-Operator Inputs'!N266","v":194160},{"$f":"'Owner-Operator Inputs'!O266","v":203870}]
{"$rows_left_out":24}
{"sheet":"Private Sector Partner DCF","index":8,"n_rows":27,"n_cols":13,"rows_kept":27,"cut":false,"hidden":false,"merged":[]}
[{"$f":"'Initial Settings'!$B$5","v":"Corridor and Community DC Fast Charging Complex (Urban Site)"}]
[]
[]
["Private Sector Discounted Cash Flow Model",null,{"$f":"'Initial Settings'!$B$6","v":2017},{"$f":"'Owner-Operator Inputs'!F304","v":2018},{"$f":"'Owner-Operator Inputs'!G304","v":2019},{"$f":"'Owner-Operator Inputs'!H304","v":2020},{"$f":"'Owner-Operator Inputs'!I304","v":2021},{"$f":"'Owner-Operator Inputs'!J304","v":2022},{"$f":"'Owner-Operator Inputs'!K304","v":2023},{"$f":"'Owner-Operator Inputs'!L304","v":2024},{"$f":"'Owner-Operator Inputs'!M304","v":2025},{"$f":"'Owner-Operator Inputs'!N304","v":2026},{"$f":"'Owner-Operator Inputs'!O304","v":2027}]
[]
["Revenue",null,null,{"$f":"'Private Sector Partner Inputs'!F49","v":0},{"$f":"'Private Sector Partner Inputs'!G49","v":0},{"$f":"'Private Sector Partner Inputs'!H49","v":0},{"$f":"'Private Sector Partner Inputs'!I49","v":0},{"$f":"'Private Sector Partner Inputs'!J49","v":0},{"$f":"'Private Sector Partner Inputs'!K49","v":0},{"$f":"'Private Sector Partner Inputs'!L49","v":0},{"$f":"'Private Sector Partner Inputs'!M49","v":0},{"$f":"'Private Sector Partner Inputs'!N49","v":0},{"$f":"'Private Sector Partner Inputs'!O49","v":0}]
{"$rows_left_out":22}
{"sheet":"Public Sector Partner DCF","index":9,"n_rows":29,"n_cols":13,"rows_kept":29,"cut":false,"hidden":false,"merged":[]}
[{"$f":"'Initial Settings'!$B$5","v":"Corridor and Community DC Fast Charging Complex (Urban Site)"}]
[]
[]
["Public Sector Discounted Cash Flow Model",null,{"$f":"'Initial Settings'!$B$6","v":2017},{"$f":"'Owner-Operator Inputs'!F304","v":2018},{"$f":"'Owner-Operator Inputs'!G304","v":2019},{"$f":"'Owner-Operator Inputs'!H304","v":2020},{"$f":"'Owner-Operator Inputs'!I304","v":2021},{"$f":"'Owner-Operator Inputs'!J304","v":2022},{"$f":"'Owner-Operator Inputs'!K304","v":2023},{"$f":"'Owner-Operator Inputs'!L304","v":2024},{"$f":"'Owner-Operator Inputs'!M304","v":2025},{"$f":"'Owner-Operator Inputs'!N304","v":2026},{"$f":"'Owner-Operator Inputs'!O304","v":2027}]
[]
["Cash Outflows"]
{"$rows_left_out":24}
{"sheet":"Combined DCF","index":10,"n_rows":17,"n_cols":13,"rows_kept":17,"cut":false,"hidden":false,"merged":[]}
[{"$f":"'Initial Settings'!$B$5","v":"Corridor and Community DC Fast Charging Complex (Urban Site)"}]
[]
[]
["Combined Discounted Cash Flow Model",null,{"$f":"'Initial Settings'!$B$6","v":2017},{"$f":"'Owner-Operator Inputs'!F304","v":2018},{"$f":"'Owner-Operator Inputs'!G304","v":2019},{"$f":"'Owner-Operator Inputs'!H304","v":2020},{"$f":"'Owner-Operator Inputs'!I304","v":2021},{"$f":"'Owner-Operator Inputs'!J304","v":2022},{"$f":"'Owner-Operator Inputs'!K304","v":2023},{"$f":"'Owner-Operator Inputs'!L304","v":2024},{"$f":"'Owner-Operator Inputs'!M304","v":2025},{"$f":"'Owner-Operator Inputs'!N304","v":2026},{"$f":"'Owner-Operator Inputs'!O304","v":2027}]
[]
["Cash flow from owner-operator",null,{"$f":"'Owner-Operator DCF'!C22","v":-201056},{"$f":"'Owner-Operator DCF'!D22","v":11048.375563897309},{"$f":"'Owner-Operator DCF'!E22","v":1451.1339164774981},{"$f":"'Owner-Operator DCF'!F22","v":4496.9443692763525},{"$f":"'Owner-Operator DCF'!G22","v":7672.3657079625118},{"$f":"'Owner-Operator DCF'!H22","v":10991.164588983287},{"$f":"'Owner-Operator DCF'!I22","v":14452.292606105453},{"$f":"'Owner-Operator DCF'!J22","v":18062.612238294751},{"$f":"'Owner-Operator DCF'!K22","v":21827.619688382249},{"$f":"'Owner-Operator DCF'!L22","v":25752.417563711417},{"$f":"'Owner-Operator DCF'!M22","v":-738.81461646749449}]
{"$rows_left_out":12}
{"sheet":"Debt Schedule","index":11,"n_rows":17,"n_cols":23,"rows_kept":17,"cut":false,"hidden":false,"merged":[]}
[{"$f":"'Initial Settings'!$B$5","v":"Corridor and Community DC Fast Charging Complex (Urban Site)"}]
[]
[]
["Debt Schedule",null,"Year",1,{"$f":"D4+1","v":2},3,4,5,6,7,8,9,10,11,12,13,14,15,16,17,18,19,20]
["Public Sector Debt",null,{"$f":"'Public Sector Partner Inputs'!$F$10","v":0}]
["Annual Principal Payment",null,null,{"$f":"IF(D$4<=OFFSET(pusp_term, 0, -2),PPMT('Public Sector Partner Inputs'!$E$12,D$4,OFFSET(pusp_term, 0, -2),'Public Sector Partner Inputs'!$F$10),0)","v":0},{"$f":"IF(E$4<=OFFSET(pusp_term, 0, -2),PPMT('Public Sector Partner Inputs'!$E$12,E$4,OFFSET(pusp_term, 0, -2),'Public Sector Partner Inputs'!$F$10),0)","v":0},{"$f":"IF(F$4<=OFFSET(pusp_term, 0, -2),PPMT('Public Sector Partner Inputs'!$E$12,F$4,OFFSET(pusp_term, 0, -2),'Public Sector Partner Inputs'!$F$10),0)","v":0},{"$f":"IF(G$4<=OFFSET(pusp_term, 0, -2),PPMT('Public Sector Partner Inputs'!$E$12,G$4,OFFSET(pusp_term, 0, -2),'Public Sector Partner Inputs'!$F$10),0)","v":0},{"$f":"IF(H$4<=OFFSET(pusp_term, 0, -2),PPMT('Public Sector Partner Inputs'!$E$12,H$4,OFFSET(pusp_term, 0, -2),'Public Sector Partner Inputs'!$F$10),0)","v":0},{"$f":"IF(I$4<=OFFSET(pusp_term, 0, -2),PPMT('Public Sector Partner Inputs'!$E$12,I$4,OFFSET(pusp_term, 0, -2),'Public Sector Partner Inputs'!$F$10),0)","v":0},{"$f":"IF(J$4<=OFFSET(pusp_term, 0, -2),PPMT('Public Sector Partner Inputs'!$E$12,J$4,OFFSET(pusp_term, 0, -2),'Public Sector Partner Inputs'!$F$10),0)","v":0},{"$f":"IF(K$4<=OFFSET(pusp_term, 0, -2),PPMT('Public Sector Partner Inputs'!$E$12,K$4,OFFSET(pusp_term, 0, -2),'Public Sector Partner Inputs'!$F$10),0)","v":0},{"$f":"IF(L$4<=OFFSET(pusp_term, 0, -2),PPMT('Public Sector Partner Inputs'!$E$12,L$4,OFFSET(pusp_term, 0, -2),'Public Sector Partner Inputs'!$F$10),0)","v":0},{"$f":"IF(M$4<=OFFSET(pusp_term, 0, -2),PPMT('Public Sector Partner Inputs'!$E$12,M$4,OFFSET(pusp_term, 0, -2),'Public Sector Partner Inputs'!$F$10),0)","v":0},{"$f":"IF(N$4<=OFFSET(pusp_term, 0, -2),PPMT('Public Sector Partner Inputs'!$E$12,N$4,OFFSET(pusp_term, 0, -2),'Public Sector Partner Inputs'!$F$10),0)","v":0},{"$f":"IF(O$4<=OFFSET(pusp_term, 0, -2),PPMT('Public Sector Partner Inputs'!$E$12,O$4,OFFSET(pusp_term, 0, -2),'Public Sector Partner Inputs'!$F$10),0)","v":0},{"$f":"IF(P$4<=OFFSET(pusp_term, 0, -2),PPMT('Public Sector Partner Inputs'!$E$12,P$4,OFFSET(pusp_term, 0, -2),'Public Sector Partner Inputs'!$F$10),0)","v":0},{"$f":"IF(Q$4<=OFFSET(pusp_term, 0, -2),PPMT('Public Sector Partner Inputs'!$E$12,Q$4,OFFSET(pusp_term, 0, -2),'Public Sector Partner Inputs'!$F$10),0)","v":0},{"$f":"IF(R$4<=OFFSET(pusp_term, 0, -2),PPMT('Public Sector Partner Inputs'!$E$12,R$4,OFFSET(pusp_term, 0, -2),'Public Sector Partner Inputs'!$F$10),0)","v":0},{"$f":"IF(S$4<=OFFSET(pusp_term, 0, -2),PPMT('Public Sector Partner Inputs'!$E$12,S$4,OFFSET(pusp_term, 0, -2),'Public Sector Partner Inputs'!$F$10),0)","v":0},{"$f":"IF(T$4<=OFFSET(pusp_term, 0, -2),PPMT('Public Sector Partner Inputs'!$E$12,T$4,OFFSET(pusp_term, 0, -2),'Public Sector Partner Inputs'!$F$10),0)","v":0},{"$f":"IF(U$4<=OFFSET(pusp_term, 0, -2),PPMT('Public Sector Partner Inputs'!$E$12,U$4,OFFSET(pusp_term, 0, -2),'Public Sector Partner Inputs'!$F$10),0)","v":0},{"$f":"IF(V$4<=OFFSET(pusp_term, 0, -2),PPMT('Public Sector Partner Inputs'!$E$12,V$4,OFFSET(pusp_term, 0, -2),'Public Sector Partner Inputs'!$F$10),0)","v":0},{"$f":"IF(W$4<=OFFSET(pusp_term, 0, -2),PPMT('Public Sector Partner Inputs'!$E$12,W$4,OFFSET(pusp_term, 0, -2),'Public Sector Partner Inputs'!$F$10),0)","v":0}]
{"$rows_left_out":12}
{"sheet":"Terminal Value Model","index":12,"n_rows":16,"n_cols":12,"rows_kept":16,"cut":false,"hidden":false,"merged":[]}
[{"$f":"'Initial Settings'!$B$5","v":"Corridor and Community DC Fast Charging Complex (Urban Site)"}]
[]
[]
["Based on Assumed EBITDA Exit Multiple",{"$f":"'Initial Settings'!$B$6","v":2017},{"$f":"'Owner-Operator Inputs'!F304","v":2018},{"$f":"'Owner-Operator Inputs'!G304","v":2019},{"$f":"'Owner-Operator Inputs'!H304","v":2020},{"$f":"'Owner-Operator Inputs'!I304","v":2021},{"$f":"'Owner-Operator Inputs'!J304","v":2022},{"$f":"'Owner-Operator Inputs'!K304","v":2023},{"$f":"'Owner-Operator Inputs'!L304","v":2024},{"$f":"'Owner-Operator Inputs'!M304","v":2025},{"$f":"'Owner-Operator Inputs'!N304","v":2026},{"$f":"'Owner-Operator Inputs'!O304","v":2027}]
[]
["EBITDA",{"$f":"'Income Statement'!B23+'Income Statement'!B18","v":0},{"$f":"'Income Statement'!C23+'Income Statement'!C18","v":29058},{"$f":"'Income Statement'!D23+'Income Statement'!D18","v":34054.813499999989},{"$f":"'Income Statement'!E23+'Income Statement'!E18","v":39299.354021250008},{"$f":"'Income Statement'!F23+'Income Statement'!F18","v":44798.837700940639},{"$f":"'Income Statement'!G23+'Income Statement'!G18","v":50575.824092026975},{"$f":"'Income Statement'!H23+'Income Statement'!H18","v":56637.46103975724},{"$f":"'Income Statement'!I23+'Income Statement'!I18","v":62998.54838828338},{"$f":"'Income Statement'!J23+'Income Statement'!J18","v":69673.846753598365},{"$f":"'Income Statement'!K23+'Income Statement'!K18","v":76678.077284045517},{"$f":"'Income Statement'!L23+'Income Statement'!L18","v":84025.921419644146}]
{"$rows_left_out":11}
{"sheet":"Outputs Dashboard","index":13,"n_rows":226,"n_cols":22,"rows_kept":226,"cut":false,"hidden":false,"merged":[[2,4,2,5],[2,7,2,8],[2,10,2,21],[2,1,2,2]]}
[{"$f":"'Initial Settings'!$B$5","v":"Corridor and Community DC Fast Charging Complex (Urban Site)"}]
[]
[null,"Financial Performance Summary",null,null,"Financial Performance Details",null,null,"Charging Infrastructure Statistics",null,null,{"$f":"'Owner-Operator DCF'!A4","v":"Owner-Operator Discounted Cash Flow Model"}]
[null,"Project NPV (Payback)",{"$f":"'Outputs Dashboard'!F6  & IF('Outputs Dashboard'!F8<>\"N/A\", \" (\" & 'Outputs Dashboard'!F8 & \")\", \"\")","v":"-$54,743"},null,"Project",null,null,"Total New Sites",{"$f":"OFFSET(ooi_type_1_total_number_of_sites, 0,-2)+'Owner-Operator Inputs'!E99+'Owner-Operator Inputs'!E174","v":1},null,null,{"$f":"'Owner-Operator DCF'!C4","v":2017},{"$f":"'Owner-Operator DCF'!D4","v":2018},{"$f":"'Owner-Operator DCF'!E4","v":2019},{"$f":"'Owner-Operator DCF'!F4","v":2020},{"$f":"'Owner-Operator DCF'!G4","v":2021},{"$f":"'Owner-Operator DCF'!H4","v":2022},{"$f":"'Owner-Operator DCF'!I4","v":2023},{"$f":"'Owner-Operator DCF'!J4","v":2024},{"$f":"'Owner-Operator DCF'!K4","v":2025},{"$f":"'Owner-Operator DCF'!L4","v":2026},{"$f":"'Owner-Operator DCF'!M4","v":2027}]
[null,"Owner-Operator NPV (Payback)",{"$f":"'Outputs Dashboard'!F15 & IF('Outputs Dashboard'!F17<>\"N/A\", \" (\" & 'Outputs Dashboard'!F17 & \")\", \"\")","v":"-$136,953"},null,"Capital Investment",{"$f":"'Owner-Operator Inputs'!E281","v":502640},null,"Total New Stations",{"$f":"OFFSET(ooi_type_1_total_number_of_stations, 0, -2)+'Owner-Operator Inputs'!E98+'Owner-Operator Inputs'!E173","v":6},null,{"$f":"'Owner-Operator DCF'!A6","v":"Revenue"},{"$f":"'Owner-Operator DCF'!C6","v":0},{"$f":"'Owner-Operator DCF'!D6","v":131400},{"$f":"'Owner-Operator DCF'!E6","v":137970},{"$f":"'Owner-Operator DCF'!F6","v":144870},{"$f":"'Owner-Operator DCF'!G6","v":152110},{"$f":"'Owner-Operator DCF'!H6","v":159720},{"$f":"'Owner-Operator DCF'!I6","v":167710},{"$f":"'Owner-Operator DCF'!J6","v":176100},{"$f":"'Owner-Operator DCF'!K6","v":184910},{"$f":"'Owner-Operator DCF'!L6","v":194160},{"$f":"'Owner-Operator DCF'!M6","v":203870}]
[null,"Private Sector Partner NPV (Payback)",{"$f":"'Outputs Dashboard'!F24  & IF('Outputs Dashboard'!F26<>\"N/A\", \" (\" & 'Outputs Dashboard'!F26 & \")\", \"\")","v":"$0"},null,"Net Present Value",{"$f":"IF('Combined DCF'!B15>0, \"+\" & TEXT('Combined DCF'!B15, \"$#,##0\"), TEXT('Combined DCF'!B15, \"$#,##0\"))","v":"-$54,743"},null,"Number of Charging Sessions Provided",{"$f":"SUM('Owner-Operator Inputs'!F34:J34)+SUM('Owner-Operator Inputs'!F109:J109)+SUM('Owner-Operator Inputs'!F184:J184)","v":72607},null,{"$f":"'Owner-Operator DCF'!A7","v":"Operating Costs"},{"$f":"'Owner-Operator DCF'!C7+'Owner-Operator DCF'!C13+'Owner-Operator DCF'!C16","v":0},{"$f":"'Owner-Operator DCF'!D7+'Owner-Operator DCF'!D14+'Owner-Operator DCF'!D16","v":-94948.785916883906},{"$f":"'Owner-Operator DCF'!E7+'Owner-Operator DCF'!E14+'Owner-Operator DCF'!E16","v":-92383.131104303713},{"$f":"'Owner-Operator DCF'!F7+'Owner-Operator DCF'!F14+'Owner-Operator DCF'!F16","v":-96278.002451504872},{"$f":"'Owner-Operator DCF'!G7+'Owner-Operator DCF'!G14+'Owner-Operator DCF'!G16","v":-100384.32839281872},{"$f":"'Owner-Operator DCF'!H7+'Owner-Operator DCF'!H14+'Owner-Operator DCF'!H16","v":-104721.30393179793},{"$f":"'Owner-Operator DCF'!I7+'Owner-Operator DCF'!I14+'Owner-Operator DCF'!I16","v":-109296.96469467574},{"$f":"'Owner-Operator DCF'!J7+'Owner-Operator DCF'!J14+'Owner-Operator DCF'!J16","v":-114125.92264248645},{"$f":"'Owner-Operator DCF'!K7+'Owner-Operator DCF'!K14+'Owner-Operator DCF'!K16","v":-119222.65601239896},{"$f":"'Owner-Operator DCF'!L7+'Owner-Operator DCF'!L14+'Owner-Operator DCF'!L16","v":-124602.03663706976},{"$f":"'Owner-Operator DCF'!M7+'Owner-Operator DCF'!M14+'Owner-Operator DCF'!M16","v":-130279.35943724871}]
{"$rows_left_out":221}
{"sheet":"Sensitivity Tables","index":14,"n_rows":163,"n_cols":9,"rows_kept":163,"cut":false,"hidden":false,"merged":[[70,5,70,8],[5,0,5,8],[21,0,21,8],[37,0,37,8],[53,0,53,8],[69,0,69,8],[6,1,6,4],[6,5,6,8],[22,1,22,4],[22,5,22,8],[38,1,38,4],[38,5,38,8],[54,1,54,4],[54,5,54,8],[86,1,86,4],[70,1,70,4],[150,1,150,4],[150,5,150,8],[134,5,134,8],[134,1,134,4],[102,1,102,4],[102,5,102,8],[85,0,85,8],[101,0,101,8],[117,0,117,8],[133,0,133,8],[149,0,149,8],[86,5,86,8],[118,1,118,4],[118,5,118,8]]}
[{"$f":"'Initial Settings'!A5","v":"Scenario Name"}]
[]
["Sensitivity Tables"]
[]
["Sensitivity Analysis #01"]
[{"$f":"VLOOKUP(_xlfn.NUMBERVALUE(RIGHT(A5, 2)), SensitivitySummary[], 2,FALSE)","v":"Expected annual utilization growth rate [%]"}]
{"$rows_left_out":158}
{"sheet":"Income Statement","index":15,"n_rows":34,"n_cols":12,"rows_kept":34,"cut":false,"hidden":false,"merged":[]}
[{"$f":"'Initial Settings'!$B$5","v":"Corridor and Community DC Fast Charging Complex (Urban Site)"}]
[]
["Consolidated Statements of Income [$]"]
[]
[null,{"$f":"'Initial Settings'!B6","v":2017},{"$f":"'Owner-Operator Inputs'!F304","v":2018},{"$f":"'Owner-Operator Inputs'!G304","v":2019},{"$f":"'Owner-Operator Inputs'!H304","v":2020},{"$f":"'Owner-Operator Inputs'!I304","v":2021},{"$f":"'Owner-Operator Inputs'!J304","v":2022},{"$f":"'Owner-Operator Inputs'!K304","v":2023},{"$f":"'Owner-Operator Inputs'!L304","v":2024},{"$f":"'Owner-Operator Inputs'!M304","v":2025},{"$f":"'Owner-Operator Inputs'!N304","v":2026},{"$f":"'Owner-Operator Inputs'!O304","v":2027}]
["Revenues"]
{"$rows_left_out":29}
{"sheet":"Balance Sheet","index":16,"n_rows":39,"n_cols":12,"rows_kept":39,"cut":false,"hidden":false,"merged":[]}
[{"$f":"'Initial Settings'!B5","v":"Corridor and Community DC Fast Charging Complex (Urban Site)"}]
[]
["Consolidated Balance Sheet [$]"]
[]
["Assets",{"$f":"+'Initial Settings'!$B$6","v":2017},{"$f":"+'Owner-Operator Inputs'!F304","v":2018},{"$f":"+'Owner-Operator Inputs'!G304","v":2019},{"$f":"+'Owner-Operator Inputs'!H304","v":2020},{"$f":"+'Owner-Operator Inputs'!I304","v":2021},{"$f":"+'Owner-Operator Inputs'!J304","v":2022},{"$f":"+'Owner-Operator Inputs'!K304","v":2023},{"$f":"+'Owner-Operator Inputs'!L304","v":2024},{"$f":"+'Owner-Operator Inputs'!M304","v":2025},{"$f":"+'Owner-Operator Inputs'!N304","v":2026},{"$f":"+'Owner-Operator Inputs'!O304","v":2027}]
["Current assets"]
{"$rows_left_out":34}
{"sheet":"Cash Flow Statements","index":17,"n_rows":30,"n_cols":15,"rows_kept":30,"cut":false,"hidden":false,"merged":[]}
[{"$f":"'Initial Settings'!$B$5","v":"Corridor and Community DC Fast Charging Complex (Urban Site)"}]
[]
["Consolidated Statement of Cash Flows [$]"]
[]
[null,null,null,null,null,{"$f":"'Owner-Operator Inputs'!F304","v":2018},{"$f":"'Owner-Operator Inputs'!G304","v":2019},{"$f":"'Owner-Operator Inputs'!H304","v":2020},{"$f":"'Owner-Operator Inputs'!I304","v":2021},{"$f":"'Owner-Operator Inputs'!J304","v":2022},{"$f":"'Owner-Operator Inputs'!K304","v":2023},{"$f":"'Owner-Operator Inputs'!L304","v":2024},{"$f":"'Owner-Operator Inputs'!M304","v":2025},{"$f":"'Owner-Operator Inputs'!N304","v":2026},{"$f":"'Owner-Operator Inputs'!O304","v":2027}]
["Cash Flow from Operations"]
{"$rows_left_out":25}
{"sheet":"Version","index":18,"n_rows":14,"n_cols":5,"rows_kept":14,"cut":false,"hidden":false,"merged":[]}
["Version","Date","Author","Organization","Revisions"]
[1,"2015-11-01","Philip Quebe","The Cadmus Group, Inc.","First launch"]
[1.1000000000000001,"2015-11-01","Philip Quebe","The Cadmus Group, Inc.","Added cumulative NPV and new discounted payback calculations (removed old average payback based on IRR)\nFixed #N/As on sensitivity charts\nAdded other contributions to outputs tab"]
[1.5,"2015-11-01","Philip Quebe","The Cadmus Group, Inc.","Streamlined the sensitivity analysis. Put the tables on a separate tab. Redid table formats\nRewired the sensitivity analysis so that it pulls inputs from the input tabs, not the other way around.\nMajor overhaul to more accurately reflect equipment lives other than 10 years. Examples:\n - Owner-operator income streams now stop if equipment depreciates faster than 10 years\n - Terminal value function has been redone to consider equipment value if there is remaining equipment life at the end of the 10-year DCF\nConsolidated some variables like equipment life, revenue per hour, etc. so that one variable feeds into all three station types. This removes some granularity of control, but makes sensitivity analysis easier.\nReversed the flow of the equation on the “Private Sector” tabs to derive revenue from NPV value instead of an NPV value from revenue (as requested by C2ES) \nMoved sensitivity charts off output tab. Added additional charts."]
[1.6,"2015-11-01","Philip Quebe","The Cadmus Group, Inc.","Revised revenue sharing formulas\nAdd capped (semi-subordinated) public equity option (functions like a loan that is repaid only if funds are available)\nAdd blended discount rate for the project"]
[1.7,"2015-11-01","Nick Nigro","Center for Climate and Energy Solutions","Add ability to import/export all user inputs. Named each user input cell.\nChange private sector partner summary for charging equipment (allow for individual subsidies by station type).\nAdded \"Report\" tab"]
{"$rows_left_out":8}